TLSP
type: Concept
type: Thing
type: NamedIndividual
type: Protocol
label: Transport Layer Security Protocol using Kryptonet key management
notation: tlsp
term status: stable
date: 1994-10
description: Transport Layer Security Protocol using Kryptonet key management
in dataset: protocol

Christer Oberg
type: Agent

tlsp
type: Document
primary topic: TLSP