268435456-268451839:
type: Concept
type: Thing
type: NamedIndividual
type: URIScheme
label: Allocated to Spacely Packets, LLC to provide IPN/IP Gateway services to private sector stakeholders.
notation: 268435456-268451839
term status: stable
date: 2022-09-15
description: Allocated to Spacely Packets, LLC to provide IPN/IP Gateway services to private sector stakeholders.
in dataset: scheme
replaces: http://uri4uri.net/scheme/268435456-268451839

Scott Johnson
type: Agent

268435456-268451839
type: Document
primary topic: 268435456-268451839: