268484608-268500991:
type: Concept
type: Thing
type: NamedIndividual
type: URIScheme
label: Allocated to LateLab AB for various terrestrial DTN deployments and services.
notation: 268484608-268500991
term status: stable
date: 2022-12-26
description: Allocated to LateLab AB for various terrestrial DTN deployments and services.
in dataset: scheme
replaces: http://uri4uri.net/scheme/268484608-268500991

Samo Grasic
type: Agent

268484608-268500991
type: Document
primary topic: 268484608-268500991: