268500992-268517375:
type: Concept
type: Thing
type: NamedIndividual
type: URIScheme
label: Allocated to MEIS d.o.o. from Slovenia for various terrestrial DTN testbeds.
notation: 268500992-268517375
term status: stable
date: 2022-12-26
description: Allocated to MEIS d.o.o. from Slovenia for various terrestrial DTN testbeds.
in dataset: scheme
replaces: http://uri4uri.net/scheme/268500992-268517375

Boštjan Grašič
type: Agent

268500992-268517375
type: Document
primary topic: 268500992-268517375: