268517376-268533759:
type: Concept
type: Thing
type: NamedIndividual
type: URIScheme
label: Allocated to Digital Health Information Network Inc. for Space applications in digital health and terrestrial DTN services.
notation: 268517376-268533759
term status: stable
date: 2023-01-06
description: Allocated to Digital Health Information Network Inc. for Space applications in digital health and terrestrial DTN services.
in dataset: scheme
replaces: http://uri4uri.net/scheme/268517376-268533759

Oscar Garcia
type: Agent

268517376-268533759
type: Document
primary topic: 268517376-268533759: