268550144-268566527:
type: Concept
type: Thing
type: NamedIndividual
type: URIScheme
label: Assigned to LJCV Electronics for Development of an Experimental R&D DTN, STEM Education, space and terrestrial applications.
notation: 268550144-268566527
term status: stable
date: 2023-02-13
description: Assigned to LJCV Electronics for Development of an Experimental R&D DTN, STEM Education, space and terrestrial applications.
in dataset: scheme
replaces: http://uri4uri.net/scheme/268550144-268566527

Jorge Amodio
type: Agent

268550144-268566527
type: Document
primary topic: 268550144-268566527: