268582912-268599295:
type: Concept
type: Thing
type: NamedIndividual
type: URIScheme
label: Allocated to Bull Reef Aquaculture for underwater sensing, automation, and coral reef/climate change research applications.
notation: 268582912-268599295
term status: stable
date: 2023-05-04
description: Allocated to Bull Reef Aquaculture for underwater sensing, automation, and coral reef/climate change research applications.
in dataset: scheme
replaces: http://uri4uri.net/scheme/268582912-268599295

Dr. Ronny L. Bull
type: Agent

268582912-268599295
type: Document
primary topic: 268582912-268599295: