268599296-268615679:
type: Concept
type: Thing
type: NamedIndividual
type: URIScheme
label: XRTC-based terrestrial and interplanetary end-to-end DTN communication services to simplify mission planning and implementation by providing standardized data transmission services across agencies, institutions, contractors and suppliers.
notation: 268599296-268615679
term status: stable
date: 2023-05-16
description: XRTC-based terrestrial and interplanetary end-to-end DTN communication services to simplify mission planning and implementation by providing standardized data transmission services across agencies, institutions, contractors and suppliers.
in dataset: scheme
replaces: http://uri4uri.net/scheme/268599296-268615679

Sauli Kiviranta
type: Agent

268599296-268615679
type: Document
primary topic: 268599296-268615679: