268615680-268632063:
type: Concept
type: Thing
type: NamedIndividual
type: URIScheme
label: Assigned to Intuitive Machines for terrestrial and Lunar Data Network DTN services.
notation: 268615680-268632063
term status: stable
date: 2023-06-01
description: Assigned to Intuitive Machines for terrestrial and Lunar Data Network DTN services.
in dataset: scheme
replaces: http://uri4uri.net/scheme/268615680-268632063

Jorge Amodio
type: Agent

268615680-268632063
type: Document
primary topic: 268615680-268632063: