268632064-268648447:
type: Concept
type: Thing
type: NamedIndividual
type: URIScheme
label: Allocated to Opal Labs for terrestrial DTN HIL testbeds.
notation: 268632064-268648447
term status: stable
date: 2023-06-14
description: Allocated to Opal Labs for terrestrial DTN HIL testbeds.
in dataset: scheme
replaces: http://uri4uri.net/scheme/268632064-268648447

Aadesh Brahmbhatt
type: Agent

268632064-268648447
type: Document
primary topic: 268632064-268648447: