268681216-268697599:
type: Concept
type: Thing
type: NamedIndividual
type: URIScheme
label: Allocated to the Clarkson Open Source Institute (COSI) at Clarkson University for conducting academic research on networks in challenging environments.
notation: 268681216-268697599
term status: stable
date: 2023-07-28
description: Allocated to the Clarkson Open Source Institute (COSI) at Clarkson University for conducting academic research on networks in challenging environments.
in dataset: scheme
replaces: http://uri4uri.net/scheme/268681216-268697599

Jeanna Matthews
type: Agent

268681216-268697599
type: Document
primary topic: 268681216-268697599: