268713984-268730367:
type: Concept
type: Thing
type: NamedIndividual
type: URIScheme
label: Intuitive Machines Bundle Protocol Routing and Network Architecture Research
notation: 268713984-268730367
term status: stable
date: 2023-08-07
description: Intuitive Machines Bundle Protocol Routing and Network Architecture Research
in dataset: scheme
replaces: http://uri4uri.net/scheme/268713984-268730367

Jorge Amodio
type: Agent

268713984-268730367
type: Document
primary topic: 268713984-268730367: