268730368-268746751:
type: Concept
type: Thing
type: NamedIndividual
type: URIScheme
label: Allocated to Comtron Space Software, Mar del Plata, Argentina for developing, testing and deploying software applications for space and earth using DTN.
notation: 268730368-268746751
term status: stable
date: 2023-08-22
description: Allocated to Comtron Space Software, Mar del Plata, Argentina for developing, testing and deploying software applications for space and earth using DTN.
in dataset: scheme
replaces: http://uri4uri.net/scheme/268730368-268746751

Oscar Abelardo Garcia
type: Agent

268730368-268746751
type: Document
primary topic: 268730368-268746751: