268763136-268779519:
type: Concept
type: Thing
type: NamedIndividual
type: URIScheme
label: Allocated to D3TN U.S. to provide DTN services and for DTN research and development projects.
notation: 268763136-268779519
term status: stable
date: 2023-10-23
description: Allocated to D3TN U.S. to provide DTN services and for DTN research and development projects.
in dataset: scheme
replaces: http://uri4uri.net/scheme/268763136-268779519

Juan A. Fraire
type: Agent

268763136-268779519
type: Document
primary topic: 268763136-268779519: