info:
type: Concept
type: Thing
type: NamedIndividual
type: URIScheme
label: Information Assets with Identifiers in Public Namespaces.
notation: info
term status: stable
modified: 2015-07-08
description: Information Assets with Identifiers in Public Namespaces.
IANA ref: RFC4452
IANA ref: info-uri.info
in dataset: scheme
replaces: info

RFC4452
type: Document

info
type: Document
primary topic: info: