machineprovisioningprogressreporter:
type: Concept
type: Thing
type: NamedIndividual
type: URIScheme
label: Windows Autopilot Modern Device Management status updates
notation: machineprovisioningprogressreporter
term status: testing
date: 2024-02-07
description: Windows Autopilot Modern Device Management status updates
in dataset: scheme
replaces: machineprovisioningprogressreporter

urischemeowners at microsoft.com
type: Agent

machineprovisioningprogressreporter
type: Document
primary topic: machineprovisioningprogressreporter: