mt:
type: Concept
type: Thing
type: NamedIndividual
type: URIScheme
label: Matter protocol on-boarding payloads that are encoded for use in QR Codes and/or NFC Tags
notation: mt
term status: stable
date: 2021-05-17
modified: 2023-01-20
description: Matter protocol on-boarding payloads that are encoded for use in QR Codes and/or NFC Tags
IANA ref: csa-iot.org
in dataset: scheme
replaces: mt

mt
type: Document
primary topic: mt: