tttps:
type: Concept
type: Thing
type: NamedIndividual
type: URIScheme
label: TLS TimeToken Secure Protocol (TTTPS). A cryptographic temporal ordering proof protocol augmenting TLS 1.3 with Proof-of-Time records.
notation: tttps
term status: testing
date: 2026-06-29
description: TLS TimeToken Secure Protocol (TTTPS). A cryptographic temporal ordering proof protocol augmenting TLS 1.3 with Proof-of-Time records.
in dataset: scheme
replaces: tttps

tttps
type: Document
primary topic: tttps: