16384-2097151:
type: Concept
type: Thing
type: NamedIndividual
type: URIScheme
label: Allocated to the Space Assigned Numbers Authority (
notation: 16384-2097151
term status: stable
description: Allocated to the Space Assigned Numbers Authority (
IANA ref: sanaregistry.org
IANA ref: RFC7116
in dataset: scheme
replaces: http://uri4uri.net/scheme/16384-2097151

RFC7116
type: Document

16384-2097151
type: Document
primary topic: 16384-2097151: