268533760-268550143:
type: Concept
type: Thing
type: NamedIndividual
type: URIScheme
label: Allocated to Shirokuma-AI for artificial intelligence-driven space applications and terrestrial DTN services in the fields of healthcare, robotics, wearables and edge devices, information processing and discovery.
notation: 268533760-268550143
term status: stable
date: 2023-01-20
description: Allocated to Shirokuma-AI for artificial intelligence-driven space applications and terrestrial DTN services in the fields of healthcare, robotics, wearables and edge devices, information processing and discovery.
in dataset: scheme
replaces: http://uri4uri.net/scheme/268533760-268550143

Larissa Suzuki
type: Agent

268533760-268550143
type: Document
primary topic: 268533760-268550143: