2097152-268435455:
type: Concept
type: Thing
type: NamedIndividual
type: URIScheme
label: Reserved for Private or Experimental Use
notation: 2097152-268435455
term status: stable
description: Reserved for Private or Experimental Use
IANA ref: RFC7116
in dataset: scheme
replaces: http://uri4uri.net/scheme/2097152-268435455

RFC7116
type: Document

2097152-268435455
type: Document
primary topic: 2097152-268435455: