268451840-268468223:
type: Concept
type: Thing
type: NamedIndividual
type: URIScheme
label: Allocated to SPATIAM CORPORATION to provide DTN services to organizations.
notation: 268451840-268468223
term status: stable
date: 2022-10-21
description: Allocated to SPATIAM CORPORATION to provide DTN services to organizations.
in dataset: scheme
replaces: http://uri4uri.net/scheme/268451840-268468223

Alberto Montilla
type: Agent

268451840-268468223
type: Document
primary topic: 268451840-268468223: