268648448-268664831:
type: Concept
type: Thing
type: NamedIndividual
type: URIScheme
label: Allocated to the SUNY Polytechnic Institute College of Engineering for conducting academic research in applying Delay/Disruption Tolerant Networking to Networks in Challenging Environments.
notation: 268648448-268664831
term status: stable
date: 2023-07-17
modified: 2023-07-18
description: Allocated to the SUNY Polytechnic Institute College of Engineering for conducting academic research in applying Delay/Disruption Tolerant Networking to Networks in Challenging Environments.
in dataset: scheme
replaces: http://uri4uri.net/scheme/268648448-268664831

Dr. Ronny L. Bull
type: Agent

268648448-268664831
type: Document
primary topic: 268648448-268664831: