sms:
type: Concept
type: Thing
type: NamedIndividual
type: URIScheme
label: Short Message Service
notation: sms
term status: stable
description: Short Message Service
IANA ref: RFC5724
relation: SMS
different from: SMS
in dataset: scheme
replaces: sms

RFC5724
type: Document

SMS
type: Concept
type: Thing
type: NamedIndividual
type: Service
label: Short Text Message Sending and Delivery Status Service
notation: sms
term status: stable
description: Short Text Message Sending and Delivery Status Service
in dataset: service

Christian Flintrup
type: Agent

sms
type: Document
primary topic: sms: