ALLJOYN-STM
type: Concept
type: Thing
type: NamedIndividual
type: Service
label: Contact Port for AllJoyn standard messaging
notation: alljoyn-stm
term status: stable
date: 2012-03-14
description: Contact Port for AllJoyn standard messaging
ports: 9955 (TCP)
in dataset: service

Craig Dowell
type: Agent

9955 (TCP)
type: Port
notation: 9955

TCP
type: Concept
type: Thing
type: NamedIndividual
type: Protocol
label: Transmission Control
notation: tcp
term status: stable
description: Transmission Control
IANA ref: RFC9293
in dataset: protocol
has part: 9955 (TCP)

RFC9293
type: Document

alljoyn-stm
type: Document
primary topic: ALLJOYN-STM