APSOLAB-COLS
type: Concept
type: Thing
type: NamedIndividual
type: Service
label: The Apsolab company's secure data collection protocol (native api)
notation: apsolab-cols
term status: stable
date: 2014-11-10
description: The Apsolab company's secure data collection protocol (native api)
ports: 5471 (TCP)
in dataset: service

Jean-Francois Gauthier
type: Agent

5471 (TCP)
type: Port
notation: 5471

TCP
type: Concept
type: Thing
type: NamedIndividual
type: Protocol
label: Transmission Control
notation: tcp
term status: stable
description: Transmission Control
IANA ref: RFC9293
in dataset: protocol
has part: 5471 (TCP)

RFC9293
type: Document

apsolab-cols
type: Document
primary topic: APSOLAB-COLS