ATLASSIANAPP
type: Concept
type: Thing
type: NamedIndividual
type: Service
label: Atlassian Application (JIRA, Confluence, Fisheye, Crucible, Crowd, Bamboo) discovery service
notation: atlassianapp
term status: stable
description: Atlassian Application (JIRA, Confluence, Fisheye, Crucible, Crowd, Bamboo) discovery service
in dataset: service

Denise Fernandez
type: Agent

atlassianapp
type: Document
primary topic: ATLASSIANAPP