AUTHORITYGATE
type: Concept
type: Thing
type: NamedIndividual
type: Service
label: AuthorityGate Secure API communication for Orchestrated task sequencing
notation: authoritygate
term status: stable
date: 2025-03-28
description: AuthorityGate Secure API communication for Orchestrated task sequencing
ports: 7668 (TCP)
in dataset: service

Kevin Komlosy
type: Agent

7668 (TCP)
type: Port
notation: 7668

TCP
type: Concept
type: Thing
type: NamedIndividual
type: Protocol
label: Transmission Control
notation: tcp
term status: stable
description: Transmission Control
IANA ref: RFC9293
in dataset: protocol
has part: 7668 (TCP)

RFC9293
type: Document

authoritygate
type: Document
primary topic: AUTHORITYGATE