AVATARS-SEC
type: Concept
type: Thing
type: NamedIndividual
type: Service
label: Libravatar federated avatar hosting service.
notation: avatars-sec
term status: stable
date: 2011-10-11
description: Libravatar federated avatar hosting service.
in dataset: service

Francois Marier
type: Agent

TCP
type: Concept
type: Thing
type: NamedIndividual
type: Protocol
label: Transmission Control
notation: tcp
term status: stable
description: Transmission Control
IANA ref: RFC9293
in dataset: protocol
has part: AVATARS-SEC

RFC9293
type: Document

avatars-sec
type: Document
primary topic: AVATARS-SEC