BEYONDIDENTITY
type: Concept
type: Thing
type: NamedIndividual
type: Service
label: Beyond Identity Platform Authenticator S
notation: beyondidentity
term status: stable
date: 2024-01-17
description: Beyond Identity Platform Authenticator S
in dataset: service

Beyond Identity Inc.
type: Agent

Monty Wiseman
type: Agent

TCP
type: Concept
type: Thing
type: NamedIndividual
type: Protocol
label: Transmission Control
notation: tcp
term status: stable
description: Transmission Control
IANA ref: RFC9293
in dataset: protocol
has part: BEYONDIDENTITY

RFC9293
type: Document

beyondidentity
type: Document
primary topic: BEYONDIDENTITY