BIOTIC
type: Concept
type: Thing
type: NamedIndividual
type: Service
label: BIOTIC - Binary Internet of Things Interoperable Communication
notation: biotic
term status: stable
date: 2014-06-16
modified: 2015-11-25
description: BIOTIC - Binary Internet of Things Interoperable Communication
ports: 5087 (TCP)
in dataset: service

Peter Waher
type: Agent

5087 (TCP)
type: Port
notation: 5087

TCP
type: Concept
type: Thing
type: NamedIndividual
type: Protocol
label: Transmission Control
notation: tcp
term status: stable
description: Transmission Control
IANA ref: RFC9293
in dataset: protocol
has part: 5087 (TCP)

RFC9293
type: Document

biotic
type: Document
primary topic: BIOTIC