BITTORRENT
type: Concept
type: Thing
type: NamedIndividual
type: Service
label: BitTorrent Zeroconf Peer Discovery Protocol
notation: bittorrent
term status: stable
description: BitTorrent Zeroconf Peer Discovery Protocol
in dataset: service

Robin Perkins
type: Agent

bittorrent
type: Document
primary topic: BITTORRENT