BRSKI-REGISTRAR
type: Concept
type: Thing
type: NamedIndividual
type: Service
label: The Bootstrapping Remote Secure Key Infrastructure Registrar
notation: brski-registrar
term status: stable
date: 2020-04-29
description: The Bootstrapping Remote Secure Key Infrastructure Registrar
IANA ref: RFC8995
in dataset: service

RFC8995
type: Document

IETF Chair
type: Agent

TCP
type: Concept
type: Thing
type: NamedIndividual
type: Protocol
label: Transmission Control
notation: tcp
term status: stable
description: Transmission Control
IANA ref: RFC9293
in dataset: protocol
has part: BRSKI-REGISTRAR

RFC9293
type: Document

brski-registrar
type: Document
primary topic: BRSKI-REGISTRAR