CARDDAVS
type: Concept
type: Thing
type: NamedIndividual
type: Service
label: vCard Extensions to WebDAV (CardDAV) - over TLS
notation: carddavs
term status: stable
date: 2012-02-17
description: vCard Extensions to WebDAV (CardDAV) - over TLS
IANA ref: RFC6352
in dataset: service

RFC6352
type: Document

IETF Chair
type: Agent

TCP
type: Concept
type: Thing
type: NamedIndividual
type: Protocol
label: Transmission Control
notation: tcp
term status: stable
description: Transmission Control
IANA ref: RFC9293
in dataset: protocol
has part: CARDDAVS

RFC9293
type: Document

carddavs
type: Document
primary topic: CARDDAVS