CARDIFFTEC-BACK
type: Concept
type: Thing
type: NamedIndividual
type: Service
label: A port for communication between a server and client for a custom backup system
notation: cardifftec-back
term status: stable
date: 2016-05-19
description: A port for communication between a server and client for a custom backup system
ports: 4573 (TCP)
in dataset: service

Benjamin Misell
type: Agent

4573 (TCP)
type: Port
notation: 4573

TCP
type: Concept
type: Thing
type: NamedIndividual
type: Protocol
label: Transmission Control
notation: tcp
term status: stable
description: Transmission Control
IANA ref: RFC9293
in dataset: protocol
has part: 4573 (TCP)

RFC9293
type: Document

cardifftec-back
type: Document
primary topic: CARDIFFTEC-BACK