CBUS
type: Concept
type: Thing
type: NamedIndividual
type: Service
label: Model Railway control using the CBUS message protocol
notation: cbus
term status: stable
date: 2017-01-03
description: Model Railway control using the CBUS message protocol
ports: 5550 (TCP)
in dataset: service

Pete Brownlow
type: Agent

5550 (TCP)
type: Port
notation: 5550

TCP
type: Concept
type: Thing
type: NamedIndividual
type: Protocol
label: Transmission Control
notation: tcp
term status: stable
description: Transmission Control
IANA ref: RFC9293
in dataset: protocol
has part: 5550 (TCP)

RFC9293
type: Document

cbus
type: Document
primary topic: CBUS