CODEMETER-CMWAN
type: Concept
type: Thing
type: NamedIndividual
type: Service
label: TPC/IP requests of copy protection software to a server
notation: codemeter-cmwan
term status: stable
date: 2013-06-25
description: TPC/IP requests of copy protection software to a server
ports: 22351 (TCP)
in dataset: service

Wolfgang Völker
type: Agent

22351 (TCP)
type: Port
notation: 22351

TCP
type: Concept
type: Thing
type: NamedIndividual
type: Protocol
label: Transmission Control
notation: tcp
term status: stable
description: Transmission Control
IANA ref: RFC9293
in dataset: protocol
has part: 22351 (TCP)

RFC9293
type: Document

codemeter-cmwan
type: Document
primary topic: CODEMETER-CMWAN