COM-OCS-ES-MCC
type: Concept
type: Thing
type: NamedIndividual
type: Service
label: ElectraStar media centre control protocol
notation: com-ocs-es-mcc
term status: stable
description: ElectraStar media centre control protocol
in dataset: service

com-ocs-es-mcc
type: Document
primary topic: COM-OCS-ES-MCC