CORA
type: Concept
type: Thing
type: NamedIndividual
type: Service
label: Client Connection Management and Data Exchange Service
notation: cora
term status: stable
date: 2016-11-10
description: Client Connection Management and Data Exchange Service
ports: 19220 (TCP)
in dataset: service

Ronny Krüger
type: Agent

19220 (TCP)
type: Port
notation: 19220

TCP
type: Concept
type: Thing
type: NamedIndividual
type: Protocol
label: Transmission Control
notation: tcp
term status: stable
description: Transmission Control
IANA ref: RFC9293
in dataset: protocol
has part: 19220 (TCP)

RFC9293
type: Document

cora
type: Document
primary topic: CORA