CORE-RD-TLS
type: Concept
type: Thing
type: NamedIndividual
type: Service
label: Resource Directory accessed using CoAP over TLS
notation: core-rd-tls
term status: stable
date: 2021-03-16
modified: 2022-04-14
description: Resource Directory accessed using CoAP over TLS
IANA ref: RFC9176
in dataset: service

RFC9176
type: Document

IETF Chair
type: Agent

TCP
type: Concept
type: Thing
type: NamedIndividual
type: Protocol
label: Transmission Control
notation: tcp
term status: stable
description: Transmission Control
IANA ref: RFC9293
in dataset: protocol
has part: CORE-RD-TLS

RFC9293
type: Document

core-rd-tls
type: Document
primary topic: CORE-RD-TLS