CYTV
type: Concept
type: Thing
type: NamedIndividual
type: Service
label: CyTV - Network streaming for Elgato EyeTV
notation: cytv
term status: stable
description: CyTV - Network streaming for Elgato EyeTV
in dataset: service

Andreas Junghans
type: Agent

cytv
type: Document
primary topic: CYTV