DAI-SHELL
type: Concept
type: Thing
type: NamedIndividual
type: Service
label: Server for the DAI family of client-server products
notation: dai-shell
term status: stable
date: 2012-04-30
description: Server for the DAI family of client-server products
ports: 45824 (TCP)
in dataset: service

Adam Robinson
type: Agent

45824 (TCP)
type: Port
notation: 45824

TCP
type: Concept
type: Thing
type: NamedIndividual
type: Protocol
label: Transmission Control
notation: tcp
term status: stable
description: Transmission Control
IANA ref: RFC9293
in dataset: protocol
has part: 45824 (TCP)

RFC9293
type: Document

dai-shell
type: Document
primary topic: DAI-SHELL