EHEAP
type: Concept
type: Thing
type: NamedIndividual
type: Service
label: Interactive Room Software Infrastructure (Event Sharing)
notation: eheap
term status: stable
description: Interactive Room Software Infrastructure (Event Sharing)
in dataset: service

eheap
type: Document
primary topic: EHEAP