EP
type: Concept
type: Thing
type: NamedIndividual
type: Service
label: Endpoint Protocol (EP) for use in Home Automation systems
notation: ep
term status: stable
description: Endpoint Protocol (EP) for use in Home Automation systems
in dataset: service

Tommy van der Vorst
type: Agent

ep
type: Document
primary topic: EP