FLEX-LMADMIN
type: Concept
type: Thing
type: NamedIndividual
type: Service
label: A protocol for managing license services
notation: flex-lmadmin
term status: stable
date: 2018-08-22
description: A protocol for managing license services
ports: 27010 (TCP)
in dataset: service

Paul Bland
type: Agent

27010 (TCP)
type: Port
notation: 27010

TCP
type: Concept
type: Thing
type: NamedIndividual
type: Protocol
label: Transmission Control
notation: tcp
term status: stable
description: Transmission Control
IANA ref: RFC9293
in dataset: protocol
has part: 27010 (TCP)

RFC9293
type: Document

flex-lmadmin
type: Document
primary topic: FLEX-LMADMIN