FOXTROT-START
type: Concept
type: Thing
type: NamedIndividual
type: Service
label: FoxTrot Professional Search Discovery Service
notation: foxtrot-start
term status: stable
description: FoxTrot Professional Search Discovery Service
in dataset: service

Jerome Seydoux
type: Agent

foxtrot-start
type: Document
primary topic: FOXTROT-START