GRCP
type: Concept
type: Thing
type: NamedIndividual
type: Service
label: Global Relay compliant instant messaging protocol
notation: grcp
term status: stable
date: 2012-11-28
modified: 2025-06-12
description: Global Relay compliant instant messaging protocol
ports: 9123 (TCP)
in dataset: service

Lu Vo
type: Agent

9123 (TCP)
type: Port
notation: 9123

TCP
type: Concept
type: Thing
type: NamedIndividual
type: Protocol
label: Transmission Control
notation: tcp
term status: stable
description: Transmission Control
IANA ref: RFC9293
in dataset: protocol
has part: 9123 (TCP)

RFC9293
type: Document

grcp
type: Document
primary topic: GRCP