HOWDY
type: Concept
type: Thing
type: NamedIndividual
type: Service
label: Howdy messaging and notification protocol
notation: howdy
term status: stable
modified: 2011-10-12
description: Howdy messaging and notification protocol
in dataset: service

Joseph Sickel
type: Agent

howdy
type: Document
primary topic: HOWDY