HPR-BLDLNX
type: Concept
type: Thing
type: NamedIndividual
type: Service
label: HP Remote Build System for Linux-based Systems
notation: hpr-bldlnx
term status: stable
description: HP Remote Build System for Linux-based Systems
in dataset: service

Jeffrey J. Walls
type: Agent

hpr-bldlnx
type: Document
primary topic: HPR-BLDLNX