HPR-DB
type: Concept
type: Thing
type: NamedIndividual
type: Service
label: Identifies systems that house databases for the Remote Build System and Remote Test System
notation: hpr-db
term status: stable
description: Identifies systems that house databases for the Remote Build System and Remote Test System
in dataset: service

Jeffrey J. Walls
type: Agent

hpr-db
type: Document
primary topic: HPR-DB